Theatre
type: Concept
in scheme: typology
notation: typology.theatre
definition: Premises with a fixed auditorium addressing a stage or platform, planned around sightlines and acoustics before anything else.
alternative label: theater
alternative label: concert hall
alternative label: auditorium
alternative label: Theater & concert hall
alternative label: Performing arts
hidden label: Theater & concert hall
hidden label: Performing arts
semantic id: typology.theatre
source basis: evidenced
source: architizer SUBTYPE_RULES
date: 2026-08-21