Manor
type: Concept
in scheme: typology
notation: typology.manor
definition: The principal house of a landed estate, from which the surrounding land was administered: large, old and rural, but built to be lived in rather than defended.
alternative label: manor house
alternative label: country house
broader: house
semantic id: typology.manor
source basis: authored
source: @instruments/taxonomy ADR 0001