Hotel
type: Concept
in scheme: typology
notation: typology.hotel
definition: Premises letting rooms by the night with staffed reception and service. The building; the rooms inside it are `space.hotel_room` and `space.lobby`.
alternative label: resort
alternative label: inn
alternative label: Hotel & resort
alternative label: boutique
hidden label: Hotel & resort
hidden label: boutique
semantic id: typology.hotel
source basis: evidenced
source: architizer SUBTYPE_RULES
date: 2026-08-21