Traditional
type: Concept
in scheme: style
notation: style.traditional
definition: Pre-modern decorative conventions carried forward without irony: mouldings, pattern, symmetry, furniture with a period lineage.
alternative label: Classic/ Traditional
alternative label: warm-traditional
alternative label: decorative_traditional
alternative label: classic_tailored
hidden label: Classic/ Traditional
hidden label: warm-traditional
hidden label: decorative_traditional
hidden label: classic_tailored
searched without:
  date: 2026-08-21
  query: traditional style
  scheme: aat
  via: vocab.getty.edu/sparql
semantic id: style.traditional
source basis: evidenced
source: all five estate repos
date: 2026-08-21
usage band: dominant
usage corpus: designshop room schemes
usage measured: 2026-08-18