Postmodernism
type: Concept
in scheme: style
notation: style.postmodernism
definition: Historical quotation used knowingly and often ironically; ornament readmitted as commentary.
semantic id: style.postmodernism
source basis: vendored
source: architizer STYLES
date: 2026-08-21