Parametricism
type: Concept
in scheme: style
notation: style.parametricism
definition: Form generated by rule systems and continuously varied rather than composed element by element.
alternative label: parametric
searched without:
  date: 2026-08-21
  query: Parametricism, parametric, parametric design
  scheme: aat
  via: vocab.getty.edu/sparql
semantic id: style.parametricism
source basis: vendored
source: architizer STYLES
date: 2026-08-21