Neoclassical
type: Concept
in scheme: style
notation: style.neoclassical
definition: The classical orders applied with archaeological seriousness: proportion systems, columns, entablature, strict symmetry.
alternative label: Classical & Grand
hidden label: Classical & Grand
broader: traditional
semantic id: style.neoclassical
source basis: vendored
source: architizer STYLES
date: 2026-08-21