Industrial
type: Concept
in scheme: style
notation: style.industrial
definition: Structure and services left exposed, ex-utility fabric kept rather than concealed, finishes that read as unfinished.
alternative label: Industrial & Raw
alternative label: industrial_refined
hidden label: Industrial & Raw
hidden label: industrial_refined
related: warehouse
relation:
  predicate: evokes
  target: warehouse
semantic id: style.industrial
source basis: evidenced
source: materia, architizer, designshop, materialgraph
date: 2026-08-21