High-Tech
type: Concept
in scheme: style
notation: style.high_tech
definition: Structure and services celebrated as the architecture, expressed with industrial precision.
semantic id: style.high-tech
source basis: vendored
source: architizer STYLES
date: 2026-08-21