Deconstructivism
type: Concept
in scheme: style
notation: style.deconstructivism
definition: Fragmented geometry and apparent instability, with the disruption as the subject.
related match: http://vocab.getty.edu/aat/300112407
semantic id: style.deconstructivism
source basis: vendored
source: architizer STYLES
date: 2026-08-21