Brutalism
type: Concept
in scheme: style
notation: style.brutalism
definition: Mass concrete left as struck, monumental massing, the construction method visible as the finish.
semantic id: style.brutalism
source basis: vendored
source: architizer STYLES
date: 2026-08-21