Bohemian
type: Concept
in scheme: style
notation: style.bohemian
definition: Layered, collected and informal, drawing pattern and object from many cultures without resolving them into one scheme.
alternative label: boho
related match: http://vocab.getty.edu/aat/300055776
semantic id: style.bohemian
source basis: authored
source: @instruments/taxonomy ADR 0001