Utility / Laundry Room
type: Concept
in scheme: space
notation: space.utility_room
definition: A back-of-house domestic working volume for laundry, drying, plant and overflow storage; separated from `kitchen` by not being where meals are cooked.
alternative label: laundry room
alternative label: utility
alternative label: Laundry Room
alternative label: laundry_room
hidden label: Laundry Room
hidden label: laundry_room
semantic id: space.utility-room
source basis: evidenced
source: designshop room schemes
date: 2026-08-18
usage band: common
usage corpus: designshop room schemes
usage measured: 2026-08-18