Training Room
type: Concept
in scheme: space
notation: space.training_room
definition: A taught room in a workplace rather than a school, re-set between courses and specified for adults, projection and a full day in a chair.
broader: classroom
semantic id: space.training-room
source basis: vendored
source: materialsinuse PROGRAM_SPACE_TYPES
date: 2026-08-21