Suite
type: Concept
in scheme: space
notation: space.suite
definition: A hotel room let as a run of connected rooms occupied as one unit, with a sitting room separate from the sleeping room.
broader: hotel room
semantic id: space.suite
source basis: vendored
source: materialsinuse PROGRAM_SPACE_TYPES
date: 2026-08-21