Student Lounge
type: Concept
in scheme: space
notation: space.student_lounge
definition: A lounge in a school or university given to students between classes, where the wear is heavy, constant and unsupervised.
broader: lounge
semantic id: space.student-lounge
source basis: vendored
source: materialsinuse PROGRAM_SPACE_TYPES
date: 2026-08-21