Operating Room
type: Concept
in scheme: space
notation: space.operating_room
definition: A surgical volume held under controlled air pressure and full asepsis.
alternative label: operating theatre
semantic id: room.operating-room
source basis: vendored
source: materialgraph ms_room + materialsinuse PROGRAM_SPACE_TYPES
date: 2026-08-21