Garden
type: Concept
in scheme: space
notation: space.garden
definition: A planted exterior volume held by the plot, occupied for leisure rather than crossed to get somewhere.
alternative label: yard
broader: outdoor
semantic id: space.garden
source basis: vendored
source: materialsinuse PROGRAM_SPACE_TYPES
date: 2026-08-21