Corridor
type: Concept
in scheme: space
notation: space.corridor
definition: A circulation volume markedly longer than it is wide, whose only purpose is passage between other spaces.
alternative label: passage
semantic id: room.corridor
source basis: vendored
source: materialgraph ms_room + materialsinuse PROGRAM_SPACE_TYPES
date: 2026-08-21