Classroom
type: Concept
in scheme: space
notation: space.classroom
definition: A taught volume holding a fixed cohort facing a single teaching position; a lecture theatre with raked seating is `auditorium`.
semantic id: room.classroom
source basis: vendored
source: materialgraph ms_room + materialsinuse PROGRAM_SPACE_TYPES
date: 2026-08-21