Bedroom
type: Concept
in scheme: space
notation: space.bedroom
definition: A private sleeping volume in a dwelling.
hidden label: Bedroom
semantic id: room.bedroom
source basis: vendored
source: materialgraph ms_room + materialsinuse PROGRAM_SPACE_TYPES
date: 2026-08-21
usage band: common
usage corpus: designshop room schemes
usage measured: 2026-08-18