Waterfront
type: Concept
in scheme: place
notation: place.landscape.waterfront
definition: On water that is not the sea: river, lake, dock, canal.
semantic id: place.landscape.waterfront
source basis: vendored
source: architizer CONTEXTS
date: 2026-08-21