Tropical
type: Concept
in scheme: place
notation: place.landscape.tropical
definition: Cross-ventilation, deep overhangs, screens instead of glass, planting as enclosure.
alternative label: Tropical modernism
hidden label: Tropical modernism
semantic id: place.landscape.tropical
source basis: evidenced
source: architizer
date: 2026-08-21