Suburban
type: Concept
in scheme: place
notation: place.landscape.suburban
definition: Low-density detached and semi-detached settlement around a city.
semantic id: place.landscape.suburban
source basis: vendored
source: architizer CONTEXTS
date: 2026-08-21