Rural
type: Concept
in scheme: place
notation: place.landscape.rural
definition: Open agricultural land; the working countryside rather than a scenic one.
alternative label: pastoral
semantic id: place.landscape.rural
source basis: vendored
source: architizer CONTEXTS
date: 2026-08-21