Vibrant
type: Concept
in scheme: palette
notation: palette.character.vibrant
definition: High chroma; colour is the loudest thing in the scheme.
semantic id: palette.character.vibrant
source basis: vendored
source: materialgraph colour_mood
date: 2026-08-21