Soft
type: Concept
in scheme: mood
notation: mood.soft
definition: Edges, light and contrast all diffused rather than sharp.
semantic id: mood.soft
source basis: vendored
source: materialgraph ms_mood
date: 2026-08-21