Sensual
type: Concept
in scheme: mood
notation: mood.sensual
definition: Tactile and bodily; the room invites touch.
semantic id: mood.sensual
source basis: vendored
source: materialgraph ms_mood
date: 2026-08-21