Moody
type: Concept
in scheme: mood
notation: mood.moody
definition: Dark, low-lit and enclosing, without necessarily being theatrical.
alternative label: moody-saturated
hidden label: moody-saturated
semantic id: mood.moody
source basis: vendored
source: materialgraph ms_mood
date: 2026-08-21