Editorial
type: Concept
in scheme: mood
notation: mood.editorial
definition: Composed to be photographed; the room reads as an image before a place.
semantic id: mood.editorial
source basis: vendored
source: materialgraph ms_mood
date: 2026-08-21