Domestic
type: Concept
in scheme: mood
notation: mood.domestic
definition: Lived-in and unstaged; evidence of ordinary use is present and welcome.
semantic id: mood.domestic
source basis: vendored
source: materialgraph ms_mood
date: 2026-08-21