Crisp
type: Concept
in scheme: mood
notation: mood.crisp
definition: Sharp edges and clean contrast; the opposite reading to soft.
semantic id: mood.crisp
source basis: vendored
source: materialgraph ms_mood
date: 2026-08-21