Calm
type: Concept
in scheme: mood
notation: mood.calm
definition: Low stimulus; nothing in the room asks for attention.
alternative label: serene
alternative label: tranquil
semantic id: mood.calm
source basis: vendored
source: materialgraph ms_mood
date: 2026-08-21