Airy
type: Concept
in scheme: mood
notation: mood.airy
definition: Light, open and uncrowded; volume reads as generous relative to what fills it.
semantic id: mood.airy
source basis: vendored
source: materialgraph ms_mood
date: 2026-08-21