Window
type: Concept
in scheme: element
notation: element.window
definition: A glazed opening in a wall with its frame; the glass held in it is `glazing`.
semantic id: element.window
source basis: authored
source: @instruments/taxonomy ADR 0001