Wall
type: Concept
in scheme: element
notation: element.wall
definition: A vertical plane of fabric that divides or encloses, wherever it sits in the building.
semantic id: element.wall
source basis: authored
source: @instruments/taxonomy ADR 0001