Truss
type: Concept
in scheme: element
notation: element.truss
definition: A triangulated frame spanning as one member, the triangulation carrying the load.
related match: EF 20 10 30
related: roof
relation:
  predicate: part-of
  target: roof
semantic id: element.truss
source basis: authored
source: @instruments/taxonomy ADR 0001