Tapware
type: Concept
in scheme: element
notation: element.tapware
definition: The visible outlets and controls delivering water: taps, mixers, shower heads, wastes.
alternative label: brassware
alternative label: taps
alternative label: faucets
related match: EF 55 70 38
related: sanitaryware
relation:
  predicate: part-of
  target: sanitaryware
semantic id: element.tapware
source basis: authored
source: @instruments/taxonomy ADR 0001