Suspended Ceiling
type: Concept
in scheme: element
notation: element.suspended_ceiling
definition: A ceiling hung clear of the structure, creating a serviceable void above it.
alternative label: dropped ceiling
alternative label: false ceiling
broader: ceiling
broad match: EF 30 25 12
semantic id: element.suspended-ceiling
source basis: authored
source: @instruments/taxonomy ADR 0001