Stair Tread
type: Concept
in scheme: element
notation: element.stair_tread
definition: The horizontal face of a step, which is the surface the foot lands on.
related: stair
relation:
  predicate: part-of
  target: stair
semantic id: element.stair-tread
source basis: authored
source: @instruments/taxonomy ADR 0001