Skirting
type: Concept
in scheme: element
notation: element.skirting
definition: The board closing the wall-to-floor junction, protecting the base and hiding tolerance.
alternative label: baseboard
alternative label: skirting board
related: internal wall
relation:
  predicate: part-of
  target: internal wall
semantic id: element.skirting
source basis: authored
source: @instruments/taxonomy ADR 0001