Shutter
type: Concept
in scheme: element
notation: element.shutter
definition: A hinged or sliding cover to a window opening, working by moving rather than by drawing.
related: window
relation:
  predicate: part-of
  target: window
semantic id: element.shutter
source basis: authored
source: @instruments/taxonomy ADR 0001