Sanitaryware
type: Concept
in scheme: element
notation: element.sanitaryware
definition: The plumbed-in vessels of a wet room: basin, WC pan, cistern, bath, shower tray.
alternative label: sanitary fittings
alternative label: plumbing fixtures
semantic id: element.sanitaryware
source basis: authored
source: @instruments/taxonomy ADR 0001