Pitched Roof
type: Concept
in scheme: element
notation: element.pitched_roof
definition: A roof steep enough to be covered in lapped units shedding water by gravity.
broader: roof
semantic id: element.pitched-roof
source basis: authored
source: @instruments/taxonomy ADR 0001