Picture Rail
type: Concept
in scheme: element
notation: element.picture_rail
definition: The high horizontal moulding profiled to take hanging hooks, so pictures move undrilled.
related: internal wall
relation:
  predicate: part-of
  target: internal wall
semantic id: element.picture-rail
source basis: authored
source: @instruments/taxonomy ADR 0001