Newel
type: Concept
in scheme: element
notation: element.newel
definition: The post terminating or turning a balustrade, taking the load the handrail cannot.
alternative label: newel post
related: balustrade
relation:
  predicate: part-of
  target: balustrade
semantic id: element.newel
source basis: authored
source: @instruments/taxonomy ADR 0001