Handrail
type: Concept
in scheme: element
notation: element.handrail
definition: The continuous rail sized to be gripped while moving, on a balustrade or fixed to a wall.
related: balustrade
relation:
  predicate: part-of
  target: balustrade
semantic id: element.handrail
source basis: authored
source: @instruments/taxonomy ADR 0001