Floor Finish
type: Concept
in scheme: element
notation: element.floor_finish
definition: The wearing layer laid on a floor, replaceable without touching the floor beneath it.
related: floor
relation:
  predicate: part-of
  target: floor
semantic id: element.floor-finish
source basis: authored
source: @instruments/taxonomy ADR 0001