Floor
type: Concept
in scheme: element
notation: element.floor
definition: The horizontal element you stand on, structure and deck; the layer on top is `floor_finish`.
semantic id: element.floor
source basis: authored
source: @instruments/taxonomy ADR 0001