Fireplace
type: Concept
in scheme: element
notation: element.fireplace
definition: The built opening and hearth holding a fire, taken with the flue it discharges into.
semantic id: element.fireplace
source basis: authored
source: @instruments/taxonomy ADR 0001